Alternative Condition
type: Property
comment: Constraints, prerequisites, entry conditions, or requirementst in a context where more than one alternative condition or path has been defined and from which any one path fulfills the parent condition.
description: A set of alternative conditions are not necessarily mutually exclusive paths; for example, a set of alternative concentrations for a degree may allow a person to optionally complete more than one concentration even though only one is required to earn the degree.
term status: stable
change history: https://credreg.net/ctdl/termhistory/ceterms/alternativeCondition/json
domain includes: ConditionProfile
range includes: ConditionProfile