Alternative Rule Set
type: Property
comment: Identifies the resource describing the values necessary to apply the rules defined in the rule set.
term status: unstable
change history: https://credreg.net/ctdl/termhistory/ceterms/alternativeRuleSet/json
domain includes: ComponentCondition
range includes: RuleSetProfile