Asserted By
type: Property
comment: Agent making a statement based on fact or belief.
term status: stable
change history: https://credreg.net/ctdl/termhistory/ceterms/assertedBy/json
domain includes: ConditionProfile
domain includes: JurisdictionProfile
range includes: CredentialOrganization
range includes: CredentialPerson
range includes: QACredentialOrganization