Assessment Method Description
type: Property
comment: Description of the methods used to conduct assessment.
term status: stable
change history: https://credreg.net/ctdl/termhistory/ceterms/assessmentMethodDescription/json
domain includes: AssessmentProfile
domain includes: Course
domain includes: LearningOpportunityProfile
domain includes: LearningProgram
range includes: langString