Assessment Method Type
type: Property
comment: Type of method used to conduct an assessment; select from an existing enumeration of such types.
usage note: Best practice for developing credential descriptions for the Credential Engine Registry is to use the ceterms:AssessmentMethod vocabulary.
term status: stable
change history: https://credreg.net/ctdl/termhistory/ceterms/assessmentMethodType/json
domain includes: AssessmentProfile
range includes: CredentialAlignmentObject
target scheme: AssessmentMethod