Assessment Output
type: Property
comment: Description of the assessment artifact, performance or examination.
term status: stable
change history: https://credreg.net/ctdl/termhistory/ceterms/assessmentOutput/json
domain includes: AssessmentProfile
range includes: langString