Assessment Profile
type: Property
comment: The resource being referenced is an assessment profile of the resource being described.
term status: deprecated
change history: https://credreg.net/ctdl/termhistory/ceterms/assessmentProfiled/json
range includes: AssessmentProfile