Associated Date
type: Property
comment: Statement of a date made as part of a StructuredStatement, the meaning of which is indicated by the statementType property.
term status: unstable
change history: https://credreg.net/ctdl/termhistory/ceterms/associatedDate/json
domain includes: StructuredStatement
range includes: date