Classification
type: Property
comment: Category or classification of this resource.
usage note: Where a more specific property exists, such as ceterms:naics, ceterms:isicV4, ceterms:credentialType, etc., use that property instead of this one.
term status: stable
change history: https://credreg.net/ctdl/termhistory/ceterms/classification/json
domain includes: Job
domain includes: Occupation
domain includes: Task
domain includes: WorkRole
range includes: Concept