Compares
type: Property
comment: Framework that contains terms that are compared in this AlignmentMap.
description: Frameworks may be Concept Schemes, Progression Models, and other educational frameworks.
term status: unstable
change history: https://credreg.net/ctdl/termhistory/ceterms/compares/json
domain includes: AlignmentMap
range includes: ProgressionModel
range includes: CompetencyFramework
range includes: ConceptScheme