Component Category
type: Property
comment: Identifies the type of PathwayComponent subclass not explicitly covered in the current array of PathwayComponent subclasses.
term status: stable
change history: https://credreg.net/ctdl/termhistory/ceterms/componentCategory/json
domain includes: BasicComponent
domain includes: CocurricularComponent
domain includes: ExtracurricularComponent
range includes: langString