Component Designation
type: Property
comment: Label identifying the category to further distinguish one component from another as designated by the promulgating body.
description: Examples may include "Required", "Core", "General Education", "Elective", etc.
term status: stable
change history: https://credreg.net/ctdl/termhistory/ceterms/componentDesignation/json
domain includes: AssessmentComponent
domain includes: BasicComponent
domain includes: CocurricularComponent
domain includes: CompetencyComponent
domain includes: CourseComponent
domain includes: CredentialComponent
domain includes: ExtracurricularComponent
domain includes: JobComponent
domain includes: SelectionComponent
domain includes: WorkExperienceComponent
range includes: CredentialAlignmentObject