Condition Profiled
type: Property
comment: The resource being described is a profile of the conditions being referenced.
term status: deprecated
change history: https://credreg.net/ctdl/termhistory/ceterms/conditionProfiled/json
range includes: ConditionProfile