Contact Point
type: Property
comment: Contact point for a person or organization.
term status: deprecated
superseded by: targetContactPoint
change history: https://credreg.net/ctdl/termhistory/ceterms/contactPoint/json
range includes: ContactPoint
equivalent property: contactPoint