Cost Details
type: Property
comment: Webpage or online document containing human-readable, in-depth information about costs.
term status: stable
change history: https://credreg.net/ctdl/termhistory/ceterms/costDetails/json
domain includes: CostManifest
domain includes: CostProfile
range includes: anyURI