Cost Manifest Of
type: Property
comment: Organization maintaining the cost manifest.
term status: stable
change history: https://credreg.net/ctdl/termhistory/ceterms/costManifestOf/json
domain includes: CostManifest
range includes: CredentialOrganization
range includes: Organization
range includes: QACredentialOrganization
inverse of: hasCostManifest