Credential Identifier
type: Property
comment: Globally unique identifier by which the creator, owner or provider of a credential recognizes that credential in transactions with the external environment (e.g., in verifiable claims involving the credential).
description: The identifier may take the form of a URN, UUID, ARK, DOI, INFO or any other publicly recognized, globally unique identifier scheme.
usage note: Best practice for descriptions intended for the Credential Engine Registry is to use the ceterms:ctid property for this purpose; ceterms:ctid is declared as a subproperty of ceterms:credentialId.
term status: stable
change history: https://credreg.net/ctdl/termhistory/ceterms/credentialId/json
domain includes: ApprenticeshipCertificate
domain includes: AssociateDegree
domain includes: BachelorDegree
domain includes: Badge
domain includes: Certificate
domain includes: CertificateOfCompletion
domain includes: Certification
domain includes: Credential
domain includes: Degree
domain includes: DigitalBadge
domain includes: Diploma
domain includes: DoctoralDegree
domain includes: GeneralEducationDevelopment
domain includes: JourneymanCertificate
domain includes: License
domain includes: MasterCertificate
domain includes: MasterDegree
domain includes: MicroCredential
domain includes: OpenBadge
domain includes: ProfessionalDoctorate
domain includes: QualityAssuranceCredential
domain includes: ResearchDoctorate
domain includes: SecondarySchoolDiploma
range includes: string