Credential Profiled
type: Property
comment: The resource being described is a profile of the credential being referenced.
usage note: The value of ceterms:credentialProfiled should be one of the specific subclasses of ceterms:Credential.
term status: deprecated
change history: https://credreg.net/ctdl/termhistory/ceterms/credentialProfiled/json
range includes: ApprenticeshipCertificate
range includes: AssociateDegree
range includes: BachelorDegree
range includes: Badge
range includes: Certificate
range includes: Certification
range includes: Credential
range includes: Degree
range includes: DigitalBadge
range includes: Diploma
range includes: DoctoralDegree
range includes: GeneralEducationDevelopment
range includes: JourneymanCertificate
range includes: License
range includes: MasterCertificate
range includes: MasterDegree
range includes: MicroCredential
range includes: OpenBadge
range includes: ProfessionalDoctorate
range includes: QualityAssuranceCredential
range includes: ResearchDoctorate
range includes: SecondarySchoolDiploma