Credentialing Action
type: Property
comment: Indicates a past or potential credentialing action in which the resource being described plays an 'object' role.
term status: stable
change history: https://credreg.net/ctdl/termhistory/ceterms/credentialingAction/json
domain includes: CredentialOrganization
domain includes: Organization
domain includes: QACredentialOrganization
range includes: AccreditAction
range includes: AdvancedStandingAction
range includes: ApproveAction
range includes: CredentialingAction
range includes: OfferAction
range includes: RecognizeAction
range includes: RegistrationAction
range includes: RegulateAction
range includes: RenewAction
range includes: RevokeAction
range includes: RightsAction