Credit Unit Type
type: Property
comment: Type of credit associated with both degree and non-degree learning opportunities; select from an existing enumeration of such types.
usage note: Best practice is to use concepts from a controlled vocabulary such as ceterms:CreditUnit.
term status: stable
change history: https://credreg.net/ctdl/termhistory/ceterms/creditUnitType/json
domain includes: AssessmentProfile
domain includes: ConditionProfile
domain includes: LearningOpportunityProfile
range includes: CredentialAlignmentObject
target scheme: CreditUnit