Credit Unit Type
type: Property
comment: The type of credit associated with the credit awarded or required.
term status: stable
change history: https://credreg.net/ctdl/termhistory/ceterms/creditUnitType/json
domain includes: ValueProfile
range includes: Concept
target scheme: CreditUnit