Credit Unit Type Description
type: Property
comment: Detailed description of credit unit type.
term status: stable
change history: https://credreg.net/ctdl/termhistory/ceterms/creditUnitTypeDescription/json
domain includes: AssessmentProfile
domain includes: ConditionProfile
domain includes: LearningOpportunityProfile
range includes: langString