Currency
type: Property
comment: Currency in which the monetary amount is expressed in 3-letter ISO 4217 format such as "USD".
term status: stable
change history: https://credreg.net/ctdl/termhistory/ceterms/currency/json
domain includes: AggregateDataProfile
domain includes: CostProfile
domain includes: PayProfile
range includes: string
equivalent property: currency