Data Provider
type: Property
comment: Credentialing organization or a third party providing the data.
term status: stable
change history: https://credreg.net/ctdl/termhistory/qdata/dataProvider/json
domain includes: DataSetProfile
range includes: CredentialOrganization
range includes: Organization
range includes: QACredentialOrganization