Date Signed
type: Property
comment: Date on which the document being described was signed.
term status: unstable
change history: https://credreg.net/ctdl/termhistory/ceterms/dateSigned/json
domain includes: PriorLearningPolicy
domain includes: TransferAgreement
range includes: date