Degree Minor
type: Property
comment: Optional, secondary field of study of a degree-seeking student.
usage note: Where possible, values should be taken from published frameworks defining degree majors, minors, and concentrations such as the U.S. National Center for Education Statistics' (NCES) Classification of Instructional Programs (CIP).
term status: stable
change history: https://credreg.net/ctdl/termhistory/ceterms/degreeMinor/json
domain includes: AssociateDegree
domain includes: AssociateOfAppliedArtsDegree
domain includes: AssociateOfAppliedScienceDegree
domain includes: AssociateOfArtsDegree
domain includes: AssociateOfScienceDegree
domain includes: BachelorDegree
domain includes: BachelorOfArtsDegree
domain includes: BachelorOfScienceDegree
domain includes: Degree
domain includes: DoctoralDegree
domain includes: MasterDegree
domain includes: MasterOfArtsDegree
domain includes: MasterOfScienceDegree
range includes: CredentialAlignmentObject