Delivery Type
type: Property
comment: Type of means by which a learning opportunity or assessment is delivered to credential seekers and by which they interact; select from an existing enumeration of such types.
usage note: Best practice is to use concepts from a controlled vocabulary such as the ceterms:DeliveryType vocabulary.
term status: stable
change history: https://credreg.net/ctdl/termhistory/ceterms/deliveryType/json
domain includes: AssessmentProfile
domain includes: LearningOpportunityProfile
range includes: CredentialAlignmentObject
target scheme: Delivery