Delivery Type Description
type: Property
comment: Detailed description of the delivery type of an assessment or learning opportunity.
term status: stable
change history: https://credreg.net/ctdl/termhistory/ceterms/deliveryTypeDescription/json
domain includes: AssessmentProfile
domain includes: LearningOpportunityProfile
range includes: langString