Direct Cost Type
type: Property
comment: Types of direct costs associated with earning or completing a credential, assessment or learning opportunity; select from an existing enumeration of such types.
usage note: Best practice for developing credential descriptions for the Credential Engine Registry is to use the ceterms:CostType vocabulary.
term status: stable
change history: https://credreg.net/ctdl/termhistory/ceterms/directCostType/json
sub property of: credentialAlignment
domain includes: CostProfile
range includes: CredentialAlignmentObject
target scheme: CostType