Email
type: Property
comment: Email address of the organization or person.
term status: stable
change history: https://credreg.net/ctdl/termhistory/ceterms/email/json
domain includes: ContactPoint
domain includes: CredentialOrganization
domain includes: Organization
domain includes: QACredentialOrganization
range includes: string
equivalent property: email