End Date
type: Property
comment: Date some event or activity ends.
usage note: Values should be a full date, i.e. year, month and day; if the day or month are not known use ceterms:approximateEndDate instead.
term status: stable
change history: https://credreg.net/ctdl/termhistory/ceterms/endDate/json
sub property of: temporalCoverage
domain includes: AccreditAction
domain includes: AdvancedStandingAction
domain includes: ApproveAction
domain includes: CollectionMember
domain includes: CostManifest
domain includes: CostProfile
domain includes: CredentialingAction
domain includes: OfferAction
domain includes: RecognizeAction
domain includes: RegistrationAction
domain includes: RegulateAction
domain includes: RenewAction
domain includes: RevokeAction
domain includes: RightsAction
domain includes: TransferValueProfile
domain includes: WorkforceDemandAction
domain includes: DataSetTimeFrame
range includes: date
equivalent property: endDate