Entry Condition
type: Property
comment: Prerequisites for entry into a credentialing program, a learning opportunity or an assessment including transcripts, records of previous experience, and lower-level learning opportunities.
term status: stable
change history: https://credreg.net/ctdl/termhistory/ceterms/entryCondition/json
sub property of: requires
domain includes: AssessmentProfile
domain includes: ConditionManifest
domain includes: LearningOpportunityProfile
range includes: ConditionProfile