Environmental Hazard Type
type: Property
comment: Type of condition in the physical work performance environment that entails risk exposures requiring mitigating processes; select from an existing enumeration of such types.
description: Such types may include exposure to bloodborne pathogens, airborne communicable diseases and dangerous chemicals, battlefield conditions, fire fighting, law enforcement, and so on.
term status: unstable
change history: https://credreg.net/ctdl/termhistory/ceterms/environmentalHazardType/json
domain includes: Competency
domain includes: Job
domain includes: Occupation
domain includes: Task
domain includes: WorkRole
range includes: Concept