Exact Duration
type: Property
comment: Exact period of time of an activity or event.
term status: stable
change history: https://credreg.net/ctdl/termhistory/ceterms/exactDuration/json
domain includes: DurationProfile
range includes: duration