Experience
type: Property
comment: Amount and nature of required work, experiential learning or other relevant experience.
term status: stable
change history: https://credreg.net/ctdl/termhistory/ceterms/experience/json
domain includes: ConditionProfile
range includes: langString