External Research
type: Property
comment: Research that supports or validates one or more aspects of the entity.
term status: stable
change history: https://credreg.net/ctdl/termhistory/ceterms/externalResearch/json
domain includes: AssessmentProfile
range includes: anyURI