Family Name
type: Property
comment: Family name such as the last name of a person in the U.S..
description: The ceterms:familyName property can be used along with givenName instead of the ceterms:name property.
term status: stable
change history: https://credreg.net/ctdl/termhistory/ceterms/familyName/json
domain includes: CredentialPerson
range includes: langString
equivalent property: familyName