FEIN
type: Property
comment: Federal Employer Identification Number (FEIN) identifying organizations, persons, states, government agencies, corporations, and companies.
term status: stable
change history: https://credreg.net/ctdl/termhistory/ceterms/fein/json
domain includes: CredentialOrganization
domain includes: Organization
domain includes: QACredentialOrganization
range includes: string