Financial Assistance Value
type: Property
comment: Description of the amount of financial assistance available.
term status: stable
change history: https://credreg.net/ctdl/termhistory/ceterms/financialAssistanceValue/json
domain includes: FinancialAssistanceProfile
range includes: QuantitativeValue