Framework URL
type: Property
comment: Credential framework to which the entity is aligned.
description: Frameworks may include, but are not limited to, competency frameworks and concept schemes such as industry, occupation, and instructional program codes.
term status: stable
change history: https://credreg.net/ctdl/termhistory/ceterms/framework/json
domain includes: CredentialAlignmentObject
domain includes: FinancialAlignmentObject
range includes: anyURI