Global Jurisdiction
type: Property
comment: Whether or not the credential is useful, applicable or recognized everywhere.
description: Exceptions indicated by the ceterms:jurisdictionException property apply.
term status: stable
change history: https://credreg.net/ctdl/termhistory/ceterms/globalJurisdiction/json
domain includes: JurisdictionProfile
range includes: boolean