Has Catalog
type: Property
comment: An inventory or listing of resources maintained by this Organization
term status: unstable
change history: https://credreg.net/ctdl/termhistory/ceterms/hasCatalog/json
domain includes: CredentialOrganization
domain includes: Organization
domain includes: QACredentialOrganization
range includes: anyURI