Has Child
type: Property
comment: The referenced resource is lower in some arbitrary hierarchy than this resource.
description: This property identifies a child node in the downward path in the chain of resources in a taxon path.
term status: stable
change history: https://credreg.net/ctdl/termhistory/ceasn/hasChild/json
sub property of: relation
domain includes: Competency
domain includes: AssessmentComponent
domain includes: BasicComponent
domain includes: CocurricularComponent
domain includes: CollectionComponent
domain includes: CompetencyComponent
domain includes: CourseComponent
domain includes: CredentialComponent
domain includes: ExtracurricularComponent
domain includes: JobComponent
domain includes: MultiComponent
domain includes: Task
domain includes: WorkExperienceComponent
range includes: Competency
range includes: AssessmentComponent
range includes: BasicComponent
range includes: CocurricularComponent
range includes: CollectionComponent
range includes: CompetencyComponent
range includes: CourseComponent
range includes: CredentialComponent
range includes: ExtracurricularComponent
range includes: JobComponent
range includes: MultiComponent
range includes: Task
range includes: WorkExperienceComponent
equivalent property: hasChild
inverse of: isChildOf