Has Condition
type: Property
comment: Resource referenced defines the conditions by which a rule set is satisfied.
term status: stable
change history: https://credreg.net/ctdl/termhistory/ceterms/hasCondition/json
domain includes: AssessmentComponent
domain includes: BasicComponent
domain includes: CocurricularComponent
domain includes: CompetencyComponent
domain includes: CourseComponent
domain includes: CredentialComponent
domain includes: ExtracurricularComponent
domain includes: JobComponent
domain includes: WorkExperienceComponent
range includes: ComponentCondition