Has Condition Manifest
type: Property
comment: Entity that describes a set of constraints, prerequisites, entry conditions, or requirements applicable across the organization, sub-organization or sets of credentials or acitivites.
term status: stable
change history: https://credreg.net/ctdl/termhistory/ceterms/hasConditionManifest/json
domain includes: CredentialOrganization
domain includes: Organization
domain includes: QACredentialOrganization
range includes: ConditionManifest
inverse of: conditionManifestOf