Has Facet Scheme
type: Property
comment: Concept Scheme used to characterize different aspects (facets) of descriptors of nodes in a framework or similar resource.
term status: unstable
change history: https://credreg.net/ctdl/termhistory/ceterms/hasFacetScheme/json
domain includes: QualificationsFramework
range includes: ConceptScheme