Has Group Evaluation
type: Property
comment: Whether or not the assessment activity is scored as a group.
term status: stable
change history: https://credreg.net/ctdl/termhistory/ceterms/hasGroupEvaluation/json
domain includes: AssessmentProfile
range includes: boolean