Has Specialization
type: Property
comment: More specialized profession, trade, or career field that is encompassed by the one being described.
term status: stable
change history: https://credreg.net/ctdl/termhistory/ceterms/hasSpecialization/json
domain includes: Occupation
range includes: Occupation