Has Verification Service
type: Property
comment: Entity describing available systems provided by the agent to verify credential holders.
description: Systems in place to verify credential holders and communicate the current credentialing status of all credential holders to employers and other labor market participants, as well as to education and workforce development funders and regulators.
term status: stable
change history: https://credreg.net/ctdl/termhistory/ceterms/hasVerificationService/json
domain includes: CredentialOrganization
domain includes: QACredentialOrganization
range includes: VerificationServiceProfile