Holder Must Authorize
type: Property
comment: Whether or not the credential holder must authorize the organization to provide the verification service.
term status: stable
change history: https://credreg.net/ctdl/termhistory/ceterms/holderMustAuthorize/json
domain includes: VerificationServiceProfile
range includes: boolean